Target
Dihydrofolate reductase
Ligand
BDBM50049902
Substrate
Meas. Tech.
ChEMBL_54223 (CHEMBL668101)
Ki
0.33±n/a nM
Citation
 Kuyper, LFBaccanari, DPJones, MLHunter, RNTansik, RLJoyner, SSBoytos, CMRudolph, SKKnick, VWilson, HRCaddell, JMFriedman, HSComley, JCStables, JN High-affinity inhibitors of dihydrofolate reductase: antimicrobial and anticancer activities of 7,8-dialkyl-1,3-diaminopyrrolo[3,2-f]quinazolines with small molecular size. J Med Chem 39:892-903 (1996)  
Target
Name:
Dihydrofolate reductase
Synonyms:
DFR1 Dihydrofolate Reductase (DHFR) | Tetrahydrofolate dehydrogenase
Type:
Enzyme
Mol. Mass.:
22141.77
Organism:
Candida albicans
Description:
C. albicans DHFR was expressed in E. coli BL21, and purified to homogeneity.
Residue:
192
  
Inhibitor
Name:
BDBM50049902
Synonyms:
7,8-Diethyl-7H-pyrrolo[3,2-f]quinazoline-1,3-diamine TCMDC-137851
Type:
Small organic molecule
Emp. Form.:
C14H17N5
Mol. Mass.:
255.3183
SMILES:
CCc1cc2c(ccc3nc(N)nc(N)c23)n1CC
: