Target
Endothelin-1 receptor
Ligand
BDBM50050055
Substrate
Meas. Tech.
ChEMBL_65491 (CHEMBL682366)
IC50
22±n/a nM
Citation
 von Geldern, TWHoffman, DJKester, JANellans, HNDayton, BDCalzadilla, SVMarsh, KCHernandez, LChiou, WDixon, DBWu-Wong, JROpgenorth, TJ Azole endothelin antagonists. 3. Using delta log P as a tool to improve absorption. J Med Chem 39:982-91 (1996)  
Target
Name:
Endothelin-1 receptor
Synonyms:
EDNRA ET-A ETA-R Endothelin receptor type A hET-AR
Type:
Enzyme Catalytic Domain
Mol. Mass.:
48736.88
Organism:
Homo sapiens (Human)
Description:
P25101
Residue:
427
  
Inhibitor
Name:
BDBM50050055
Synonyms:
2-[(R)-1-[(S)-2-(3-Cyclohexyl-1-methyl-ureido)-4-methyl-pentanoylamino]-2-(1-methyl-1H-indol-3-yl)-ethyl]-5-methyl-1H-imidazole-4-carboxylic acid | CHEMBL367033
Type:
Small organic molecule
Emp. Form.:
C30H42N6O4
Mol. Mass.:
550.6923
SMILES:
CC(C)C[C@H](N(C)C(=O)NC1CCCCC1)C(=O)N[C@H](Cc1cn(C)c2ccccc12)c1nc(C(O)=O)c(C)[nH]1
: