Target
Acyl-CoA:cholesterol acyltransferase
Ligand
BDBM50050362
Substrate
Meas. Tech.
ChEMBL_28665 (CHEMBL649063)
IC50
13±n/a nM
Citation
 Kataoka, KShiota, TTakeyasu, TMinoshima, TWatanabe, KTanaka, HMochizuki, TTaneda, KOta, MTanabe, HYamaguchi, H Potent inhibitors of acyl-CoA:cholesterol acyltransferase. 2. Structure-activity relationships of novel N-(2,2-dimethyl-2,3-dihydrobenzofuran-7-yl)amides. J Med Chem 39:1262-70 (1996)  
Target
Name:
Acyl-CoA:cholesterol acyltransferase
Synonyms:
ACAT
Type:
Mol. Mass.:
35405.31
Organism:
Oryctolagus cuniculus
Description:
Residue:
305
  
Inhibitor
Name:
BDBM50050362
Synonyms:
2,2-Dimethyl-dodecanoic acid (7-methoxy-4-oxo-chroman-8-yl)-amide | CHEMBL278856
Type:
Small organic molecule
Emp. Form.:
C24H37NO4
Mol. Mass.:
403.5549
SMILES:
CCCCCCCCCCC(C)(C)C(=O)Nc1c(OC)ccc2C(=O)CCOc12
: