Target
Acyl-CoA:cholesterol acyltransferase
Ligand
BDBM50050357
Substrate
Meas. Tech.
ChEMBL_28665 (CHEMBL649063)
IC50
240±n/a nM
Citation
 Kataoka, KShiota, TTakeyasu, TMinoshima, TWatanabe, KTanaka, HMochizuki, TTaneda, KOta, MTanabe, HYamaguchi, H Potent inhibitors of acyl-CoA:cholesterol acyltransferase. 2. Structure-activity relationships of novel N-(2,2-dimethyl-2,3-dihydrobenzofuran-7-yl)amides. J Med Chem 39:1262-70 (1996)  
Target
Name:
Acyl-CoA:cholesterol acyltransferase
Synonyms:
ACAT
Type:
Mol. Mass.:
35405.31
Organism:
Oryctolagus cuniculus
Description:
Residue:
305
  
Inhibitor
Name:
BDBM50050357
Synonyms:
1-Decyl-cyclopentanecarboxylic acid (2,2,6-trimethyl-2,3-dihydro-benzofuran-7-yl)-amide | CHEMBL22963
Type:
Small organic molecule
Emp. Form.:
C27H43NO2
Mol. Mass.:
413.6358
SMILES:
CCCCCCCCCCC1(CCCC1)C(=O)Nc1c2OC(C)(C)Cc2ccc1C
: