Target
D(3) dopamine receptor
Ligand
BDBM50050471
Substrate
Meas. Tech.
ChEMBL_62110 (CHEMBL674988)
Ki
480±n/a nM
Citation
 Rowley, MBroughton, HBCollins, IBaker, REmms, FMarwood, RPatel, SPatel, SRagan, CIFreedman, SBLeeson, PD 5-(4-Chlorophenyl)-4-methyl-3-(1-(2-phenylethyl)piperidin-4-yl)isoxazole: a potent, selective antagonist at human cloned dopamine D4 receptors. J Med Chem 39:1943-5 (1996)  
Target
Name:
D(3) dopamine receptor
Synonyms:
DOPAMINE D3 DRD3_HUMAN Dopamine D3 receptor (D3) Dopamine receptor Dopamine receptor D3
Type:
Mol. Mass.:
44243.43
Organism:
Homo sapiens (Human)
Description:
Residue:
400
  
Inhibitor
Name:
BDBM50050471
Synonyms:
4-[3-(4-Chloro-phenyl)-4-methyl-isoxazol-5-yl]-1-phenethyl-piperidine | CHEMBL293341
Type:
Small organic molecule
Emp. Form.:
C23H25ClN2O
Mol. Mass.:
380.91
SMILES:
Cc1c(onc1-c1ccc(Cl)cc1)C1CCN(CCc2ccccc2)CC1
: