Target
D(2) dopamine receptor
Ligand
BDBM50050470
Substrate
Meas. Tech.
ChEMBL_60056 (CHEMBL671370)
Ki
160±n/a nM
Citation
 Rowley, MBroughton, HBCollins, IBaker, REmms, FMarwood, RPatel, SPatel, SRagan, CIFreedman, SBLeeson, PD 5-(4-Chlorophenyl)-4-methyl-3-(1-(2-phenylethyl)piperidin-4-yl)isoxazole: a potent, selective antagonist at human cloned dopamine D4 receptors. J Med Chem 39:1943-5 (1996)  
Target
Name:
D(2) dopamine receptor
Synonyms:
D(2) dopamine receptor DOPAMINE D2 Long DRD2 Dopamine D2 receptor Dopamine D2 receptor (D2R) Dopamine2-like | d2
Type:
Cell-surface receptors
Mol. Mass.:
50647.10
Organism:
Homo sapiens (Human)
Description:
P14416
Residue:
443
  
Inhibitor
Name:
BDBM50050470
Synonyms:
1-(4-Chloro-benzyl)-4-[5-(4-chloro-phenyl)-isoxazol-3-yl]-piperidine | CHEMBL58296
Type:
Small organic molecule
Emp. Form.:
C21H20Cl2N2O
Mol. Mass.:
387.302
SMILES:
Clc1ccc(CN2CCC(CC2)c2cc(on2)-c2ccc(Cl)cc2)cc1
: