Target
Endothelin-1 receptor
Ligand
BDBM50050794
Substrate
Meas. Tech.
ChEMBL_65645 (CHEMBL678557)
Ki
6±n/a nM
Citation
 Riechers, HAlbrecht, HPAmberg, WBaumann, EBernard, HBöhm, HJKlinge, DKling, AMüller, SRaschack, MUnger, LWalker, NWernet, W Discovery and optimization of a novel class of orally active nonpeptidic endothelin-A receptor antagonists. J Med Chem 39:2123-8 (1996)  
Target
Name:
Endothelin-1 receptor
Synonyms:
EDNRA ET-A ETA-R Endothelin receptor type A hET-AR
Type:
Enzyme Catalytic Domain
Mol. Mass.:
48736.88
Organism:
Homo sapiens (Human)
Description:
P25101
Residue:
427
  
Inhibitor
Name:
BDBM50050794
Synonyms:
2-(4,6-Dimethoxy-pyrimidin-2-yloxy)-3-methoxy-3,3-diphenyl-propionic acid | CHEMBL25344
Type:
Small organic molecule
Emp. Form.:
C22H22N2O6
Mol. Mass.:
410.4199
SMILES:
COc1cc(OC)nc(OC(C(O)=O)C(OC)(c2ccccc2)c2ccccc2)n1
: