Target
D(2) dopamine receptor
Ligand
BDBM50050915
Substrate
Meas. Tech.
ChEMBL_62249 (CHEMBL675476)
Ki
86.48±n/a nM
Citation
 Quaglia, WPigini, MTayebati, SKPiergentili, AGiannella, MLeonardi, ATaddei, CMelchiorre, C Synthesis, absolute configuration, and biological profile of the enantiomers of trans-[2-(2,6-dimethoxyphenoxy)ethyl] [(3-p-tolyl-2,3-dihydro-1,4-benzodioxin-2-yl)methyl]amine (mephendioxan), a potent competitive alpha 1A-adrenoreceptor antagonist. J Med Chem 39:2253-8 (1996)  
Target
Name:
D(2) dopamine receptor
Synonyms:
DOPAMINE D2 DOPAMINE D2 Short Dopamine D2 receptor Drd2
Type:
G Protein-Coupled Receptor (GPCR)
Mol. Mass.:
50931.60
Organism:
Rattus norvegicus (rat)
Description:
P61169
Residue:
444
  
Inhibitor
Name:
BDBM50050915
Synonyms:
CHEMBL72657 | [2-(2,6-Dimethoxy-phenoxy)-ethyl]-((2S,3S)-3-p-tolyl-2,3-dihydro-benzo[1,4]dioxin-2-ylmethyl)-amine
Type:
Small organic molecule
Emp. Form.:
C26H29NO5
Mol. Mass.:
435.5122
SMILES:
COc1cccc(OC)c1OCCNC[C@@H]1Oc2ccccc2O[C@H]1c1ccc(C)cc1
: