Target
Metabotropic glutamate receptor 4
Ligand
BDBM50407818
Substrate
Meas. Tech.
ChEMBL_106711 (CHEMBL715717)
Ki
>280000±n/a nM
Citation
 Pellicciari, RMarinozzi, MNatalini, BCostantino, GLuneia, RGiorgi, GMoroni, FThomsen, C Synthesis and pharmacological characterization of all sixteen stereoisomers of 2-(2'-carboxy-3'-phenylcyclopropyl)glycine. Focus on (2S,1'S,2'S,3'R)-2-(2'-carboxy-3'-phenylcyclopropyl)glycine, a novel and selective group II metabotropic glutamate receptors antagonist. J Med Chem 39:2259-69 (1996)  
Target
Name:
Metabotropic glutamate receptor 4
Synonyms:
GPRC1D GRM4_HUMAN MGLUR4 Metabotropic glutamate receptor 4 (mGlu4) metabotropic glutamate 4
Type:
Protein
Mol. Mass.:
101899.95
Organism:
Homo sapiens (Human)
Description:
Q14833
Residue:
912
  
Inhibitor
Name:
BDBM50407818
Synonyms:
CHEMBL2114109
Type:
Small organic molecule
Emp. Form.:
C12H13NO4
Mol. Mass.:
235.2359
SMILES:
N[C@@H]([C@H]1[C@H]([C@@H]1c1ccccc1)C(O)=O)C(O)=O
: