Target
Gag-Pol polyprotein [489-587]
Ligand
BDBM50050952
Substrate
Meas. Tech.
ChEMBL_195516 (CHEMBL800584)
IC50
>171000±n/a nM
Citation
 Kashiwada, YHashimoto, FCosentino, LMChen, CHGarrett, PELee, KH Betulinic acid and dihydrobetulinic acid derivatives as potent anti-HIV agents. J Med Chem 39:1016-7 (1996)  
Target
Name:
Gag-Pol polyprotein [489-587]
Synonyms:
Human immunodeficiency virus type 1 protease Pol polyprotein | gag-pol
Type:
Enzyme Subunit
Mol. Mass.:
10781.16
Organism:
Human immunodeficiency virus type 1
Description:
P04585[489-587]
Residue:
99
  
Inhibitor
Name:
BDBM50050952
Synonyms:
(1R,3aS,5aR,5bR,7aR,9S,11aR,11bR,13aR,13bR)-9-(3-carboxy-2,2-dimethylpropanoyloxy)-5a,5b,8,8,11a-pentamethyl-1-(prop-1-en-2-yl)icosahydro-1H-cyclopenta[a]chrysene-3a-carboxylic acid CHEMBL7365
Type:
Small organic molecule
Emp. Form.:
C36H56O6
Mol. Mass.:
584.8262
SMILES:
CC(=C)[C@@H]1CC[C@@]2(CC[C@]3(C)[C@H](CC[C@@H]4[C@@]5(C)CC[C@H](OC(=O)C(C)(C)CC(O)=O)C(C)(C)[C@@H]5CC[C@@]34C)[C@@H]12)C(O)=O
: