Target
P-selectin
Ligand
BDBM50422189
Substrate
Meas. Tech.
ChEMBL_200029 (CHEMBL810718)
IC50
2.0±n/a nM
Citation
 Spevak, WFoxall, CCharych, DHDasgupta, FNagy, JO Carbohydrates in an acidic multivalent assembly: nanomolar P-selectin inhibitors. J Med Chem 39:1018-20 (1996)  
Target
Name:
P-selectin
Synonyms:
GMRP LYAM3_HUMAN P-selectin/P-selectin glycoprotein ligand 1 | SELP
Type:
PROTEIN
Mol. Mass.:
90834.61
Organism:
Homo sapiens (Human)
Description:
ChEMBL_1438999
Residue:
830
  
Inhibitor
Name:
BDBM50422189
Synonyms:
CHEMBL2303775
Type:
Small organic molecule
Emp. Form.:
C52H88N2O18S
Mol. Mass.:
1061.323
SMILES:
CCCCCCCCCCCCC#CC#CCCCCCCCCC(=O)NCCSCCCN([C@@H]1O[C@@H](CO)[C@@H](O[C@@H]2O[C@@H](CO)[C@H](O)[C@H](OCC(O)=O)[C@@H]2O)[C@H](O[C@@H]2O[C@@H](C)[C@@H](O)[C@H](O)[C@@H]2O)[C@@H]1O)C(C)=O
: