Target
MAP kinase-interacting serine/threonine-protein kinase 1
Ligand
BDBM50500934
Substrate
Meas. Tech.
ChEMBL_1573185 (CHEMBL3803163)
IC50
3.0±n/a nM
Citation
 Han, WDing, YXu, YPfister, KZhu, SWarne, BDoyle, MAikawa, MAmiri, PAppleton, BStuart, DDFanidi, AShafer, CM Discovery of a Selective and Potent Inhibitor of Mitogen-Activated Protein Kinase-Interacting Kinases 1 and 2 (MNK1/2) Utilizing Structure-Based Drug Design. J Med Chem 59:3034-45 (2016)  
Target
Name:
MAP kinase-interacting serine/threonine-protein kinase 1
Synonyms:
MAP Kinase-Interacting Protein Kinase (MNK1) MAP kinase-interacting serine/threonine-protein kinase 1 (MnK1) MAP-kinase interacting kinase 1 (MNK1) MKNK1 MNK1
Type:
Serine/threonine-protein kinase
Mol. Mass.:
51342.85
Organism:
Homo sapiens (Human)
Description:
Q9BUB5
Residue:
465
  
Inhibitor
Name:
BDBM50500934
Synonyms:
CHEMBL3800585
Type:
Small organic molecule
Emp. Form.:
C25H29N9O
Mol. Mass.:
471.5575
SMILES:
C[C@H]1CN(CCN1)c1cccc2nc(-c3nc(cnc3N)-c3cc(ccn3)C(=O)N(C)C)n(C)c12
: