Target
Epidermal growth factor receptor
Ligand
BDBM50051308
Substrate
Meas. Tech.
ChEMBL_5000 (CHEMBL621147)
IC50
120±n/a nM
Citation
 Traxler, PMFuret, PMett, HBuchdunger, EMeyer, TLydon, N 4-(Phenylamino)pyrrolopyrimidines: potent and selective, ATP site directed inhibitors of the EGF-receptor protein tyrosine kinase. J Med Chem 39:2285-92 (1996)  
Target
Name:
Epidermal growth factor receptor
Synonyms:
EGF Receptor Substrate EGFR_HUMAN ERBB1 Epidermal Growth Factor Receptor erbB-1 Epidermal growth factor receptor (EGFR) HER1 Proto-oncogene c-ErbB-1 Tyrosine-Protein Kinase ErbB-1
Type:
Receptor Kinase Domain
Mol. Mass.:
134279.59
Organism:
Homo sapiens (Human)
Description:
P00533
Residue:
1210
  
Inhibitor
Name:
BDBM50051308
Synonyms:
(3-Chloro-phenyl)-(9H-pyrimido[4,5-b]indol-4-yl)-amine | CHEMBL306315
Type:
Small organic molecule
Emp. Form.:
C16H11ClN4
Mol. Mass.:
294.738
SMILES:
Clc1cccc(Nc2ncnc3[nH]c4ccccc4c23)c1
: