Target
Protein kinase C alpha type
Ligand
BDBM50051307
Substrate
Meas. Tech.
ChEMBL_160269 (CHEMBL767030)
IC50
>100000±n/a nM
Citation
 Traxler, PMFuret, PMett, HBuchdunger, EMeyer, TLydon, N 4-(Phenylamino)pyrrolopyrimidines: potent and selective, ATP site directed inhibitors of the EGF-receptor protein tyrosine kinase. J Med Chem 39:2285-92 (1996)  
Target
Name:
Protein kinase C alpha type
Synonyms:
KPCA_HUMAN PKC alpha and beta-2 PKC-alpha PRKACA Protein Kinase C- alpha Protein kinase C alpha (PKCa) Protein kinase C alpha type (PRKCA) RAF proto-oncogene serine/threonine-protein kinase
Type:
Enzyme
Mol. Mass.:
76755.65
Organism:
Homo sapiens (Human)
Description:
The recombinant human PKC enzymes were produced using a baculovirus expression system in SF9 cells
Residue:
672
  
Inhibitor
Name:
BDBM50051307
Synonyms:
(5,6-Dimethyl-7H-pyrrolo[2,3-d]pyrimidin-4-yl)-(3-fluoro-phenyl)-amine | CHEMBL308582
Type:
Small organic molecule
Emp. Form.:
C14H13FN4
Mol. Mass.:
256.2782
SMILES:
Cc1[nH]c2ncnc(Nc3cccc(F)c3)c2c1C
: