Target
Protein kinase C alpha type
Ligand
BDBM50051306
Substrate
Meas. Tech.
ChEMBL_160269 (CHEMBL767030)
IC50
>100000±n/a nM
Citation
 Traxler, PMFuret, PMett, HBuchdunger, EMeyer, TLydon, N 4-(Phenylamino)pyrrolopyrimidines: potent and selective, ATP site directed inhibitors of the EGF-receptor protein tyrosine kinase. J Med Chem 39:2285-92 (1996)  
Target
Name:
Protein kinase C alpha type
Synonyms:
KPCA_HUMAN PKC alpha and beta-2 PKC-alpha PRKACA Protein Kinase C- alpha Protein kinase C alpha (PKCa) Protein kinase C alpha type (PRKCA) RAF proto-oncogene serine/threonine-protein kinase
Type:
Enzyme
Mol. Mass.:
76755.65
Organism:
Homo sapiens (Human)
Description:
The recombinant human PKC enzymes were produced using a baculovirus expression system in SF9 cells
Residue:
672
  
Inhibitor
Name:
BDBM50051306
Synonyms:
(3-Bromo-phenyl)-(6,7,8,9-tetrahydro-5H-pyrimido[4,5-b]indol-4-yl)-amine | CHEMBL72393
Type:
Small organic molecule
Emp. Form.:
C16H15BrN4
Mol. Mass.:
343.221
SMILES:
Brc1cccc(Nc2ncnc3[nH]c4CCCCc4c23)c1
: