Target
Epidermal growth factor receptor
Ligand
BDBM50051307
Substrate
Meas. Tech.
ChEMBL_67042 (CHEMBL677880)
IC50
550±n/a nM
Citation
 Traxler, PMFuret, PMett, HBuchdunger, EMeyer, TLydon, N 4-(Phenylamino)pyrrolopyrimidines: potent and selective, ATP site directed inhibitors of the EGF-receptor protein tyrosine kinase. J Med Chem 39:2285-92 (1996)  
Target
Name:
Epidermal growth factor receptor
Synonyms:
EGF Receptor Substrate EGFR_HUMAN ERBB1 Epidermal Growth Factor Receptor erbB-1 Epidermal growth factor receptor (EGFR) HER1 Proto-oncogene c-ErbB-1 Tyrosine-Protein Kinase ErbB-1
Type:
Receptor Kinase Domain
Mol. Mass.:
134279.59
Organism:
Homo sapiens (Human)
Description:
P00533
Residue:
1210
  
Inhibitor
Name:
BDBM50051307
Synonyms:
(5,6-Dimethyl-7H-pyrrolo[2,3-d]pyrimidin-4-yl)-(3-fluoro-phenyl)-amine | CHEMBL308582
Type:
Small organic molecule
Emp. Form.:
C14H13FN4
Mol. Mass.:
256.2782
SMILES:
Cc1[nH]c2ncnc(Nc3cccc(F)c3)c2c1C
: