Target
Epidermal growth factor receptor
Ligand
BDBM50051314
Substrate
Meas. Tech.
ChEMBL_67042 (CHEMBL677880)
IC50
>100000±n/a nM
Citation
 Traxler, PMFuret, PMett, HBuchdunger, EMeyer, TLydon, N 4-(Phenylamino)pyrrolopyrimidines: potent and selective, ATP site directed inhibitors of the EGF-receptor protein tyrosine kinase. J Med Chem 39:2285-92 (1996)  
Target
Name:
Epidermal growth factor receptor
Synonyms:
EGF Receptor Substrate EGFR_HUMAN ERBB1 Epidermal Growth Factor Receptor erbB-1 Epidermal growth factor receptor (EGFR) HER1 Proto-oncogene c-ErbB-1 Tyrosine-Protein Kinase ErbB-1
Type:
Receptor Kinase Domain
Mol. Mass.:
134279.59
Organism:
Homo sapiens (Human)
Description:
P00533
Residue:
1210
  
Inhibitor
Name:
BDBM50051314
Synonyms:
3-(5,6-Dimethyl-7H-pyrrolo[2,3-d]pyrimidin-4-ylamino)-benzoic acid ethyl ester | CHEMBL72976
Type:
Small organic molecule
Emp. Form.:
C17H18N4O2
Mol. Mass.:
310.3504
SMILES:
CCOC(=O)c1cccc(Nc2ncnc3[nH]c(C)c(C)c23)c1
: