Target
Adenosine receptor A3
Ligand
BDBM50028962
Substrate
Meas. Tech.
ChEMBL_31838 (CHEMBL641515)
Ki
16900±n/a nM
Citation
 Karton, YJiang, JLJi, XDMelman, NOlah, MEStiles, GLJacobson, KA Synthesis and biological activities of flavonoid derivatives as A3 adenosine receptor antagonists. J Med Chem 39:2293-301 (1996)  
Target
Name:
Adenosine receptor A3
Synonyms:
A3 adenosine receptor (hA3) ADORA3 | Adenosine A3 receptor (A3AR)
Type:
G Protein-Coupled Receptor (GPCR)
Mol. Mass.:
36197.32
Organism:
Homo sapiens (Human)
Description:
P0DMS8
Residue:
318
  
Inhibitor
Name:
BDBM50028962
Synonyms:
CHEMBL275638 | flavone
Type:
Small organic molecule
Emp. Form.:
C15H10O2
Mol. Mass.:
222.2387
SMILES:
O=c1cc(oc2ccccc12)-c1ccccc1
: