Target
Sterol O-acyltransferase 1
Ligand
BDBM50051459
Substrate
Meas. Tech.
ChEMBL_28798 (CHEMBL641708)
IC50
30±n/a nM
Citation
 O'Brien, PMSliskovic, DRPicard, JALee, HTPurchase, CFRoth, BDWhite, ADAnderson, MMueller, SBBocan, TBousley, RHamelehle, KLHoman, RLee, PKrause, BRReindel, JFStanfield, RLTurluck, D Inhibitors of acyl-CoA:cholesterol O-acyltransferase. synthesis and pharmacological activity of (+/-)-2-dodecyl-alpha-phenyl-N-(2,4,6-trimethoxyphenyl)-2H-tetrazole-5- acetamide and structurally related tetrazole amide derivatives. J Med Chem 39:2354-66 (1996)  
Target
Name:
Sterol O-acyltransferase 1
Synonyms:
ACAT-1 Acat SOAT1_RAT Sterol O-acyltransferase, Soat
Type:
PROTEIN
Mol. Mass.:
64165.56
Organism:
Rattus norvegicus
Description:
ChEMBL_28796
Residue:
545
  
Inhibitor
Name:
BDBM50051459
Synonyms:
CHEMBL77319 | N-(2,6-Diisopropyl-phenyl)-3-(2-dodecyl-2H-tetrazol-5-yl)-propionamide
Type:
Small organic molecule
Emp. Form.:
C28H47N5O
Mol. Mass.:
469.7057
SMILES:
CCCCCCCCCCCCn1nnc(CCC(=O)Nc2c(cccc2C(C)C)C(C)C)n1
: