Target
Retinoic acid receptor gamma
Ligand
BDBM31885
Substrate
Meas. Tech.
ChEMBL_196002 (CHEMBL797866)
Kd
64±n/a nM
Citation
 Yu, KLSpinazze, POstrowski, JCurrier, SJPack, EJHammer, LRoalsvig, THoneyman, JATortolani, DRReczek, PRMansuri, MMStarrett, JE Retinoic acid receptor beta,gamma-selective ligands: synthesis and biological activity of 6-substituted 2-naphthoic acid retinoids. J Med Chem 39:2411-21 (1996)  
Target
Name:
Retinoic acid receptor gamma
Synonyms:
NR1B3 RAR-gamma RARG_HUMAN Retinoic acid receptor gamma | Retinoid receptor
Type:
PROTEIN
Mol. Mass.:
50345.43
Organism:
Homo sapiens (Human)
Description:
ChEMBL_1458016
Residue:
454
  
Inhibitor
Name:
BDBM31885
Synonyms:
BMS184394 | CHEMBL82089
Type:
Small organic molecule
Emp. Form.:
C26H28O3
Mol. Mass.:
388.4987
SMILES:
CC1(C)CCC(C)(C)c2cc(ccc12)C(O)c1ccc2cc(ccc2c1)C(O)=O
: