Target
Sterol O-acyltransferase 1
Ligand
BDBM50051888
Substrate
Meas. Tech.
ChEMBL_28658 (CHEMBL643993)
IC50
50±n/a nM
Citation
 Astles, PCAshton, MJBridge, AWHarris, NVHart, TWParrott, DPPorter, BRiddell, DSmith, CWilliams, RJ Acyl-CoA:Cholesterol O-acyltransferase (ACAT) inhibitors. 2. 2-(1,3-Dioxan-2-yl)-4,5-diphenyl-1H-imidazoles as potent inhibitors of ACAT. J Med Chem 39:1423-32 (1996)  
Target
Name:
Sterol O-acyltransferase 1
Synonyms:
ACACT ACAT Acetyl-CoA acetyltransferase, mitochondrial Acyl-CoA: cholesterol acyltransferase (ACAT) Cholesterol acyltransferase 1 SOAT1 STAT
Type:
Multi-pass membrane protein may form homo- or heterodimers.
Mol. Mass.:
64751.94
Organism:
Homo sapiens (Human)
Description:
P35610
Residue:
550
  
Inhibitor
Name:
BDBM50051888
Synonyms:
CHEMBL284378 | {4-[2-(4,5-Diphenyl-1H-imidazol-2-yl)-5-methyl-[1,3]dioxan-5-yl]-butyl}-methyl-pyridin-2-yl-amine
Type:
Small organic molecule
Emp. Form.:
C30H34N4O2
Mol. Mass.:
482.6166
SMILES:
CN(CCCCC1(C)COC(OC1)c1nc(c([nH]1)-c1ccccc1)-c1ccccc1)c1ccccn1
: