Target
Reverse transcriptase/RNaseH
Ligand
BDBM50052055
Substrate
Meas. Tech.
ChEMBL_195066 (CHEMBL797521)
IC50
>500000±n/a nM
Citation
 Campiani, GNacci, VFiorini, IDe Filippis, MPGarofalo, AGreco, GNovellino, EAltamura, SDi Renzo, L Pyrrolobenzothiazepinones and pyrrolobenzoxazepinones: novel and specific non-nucleoside HIV-1 reverse transcriptase inhibitors with antiviral activity. J Med Chem 39:2672-80 (1996)  
Target
Name:
Reverse transcriptase/RNaseH
Synonyms:
HIV-1 Reverse Transcriptase RNase H Reverse transcriptase/RNaseH
Type:
PROTEIN
Mol. Mass.:
65229.15
Organism:
Human immunodeficiency virus 1
Description:
ChEMBL_1473730
Residue:
566
  
Inhibitor
Name:
BDBM50052055
Synonyms:
5-Cyclopropylmethyl-5-phenyl-6-oxa-10b-aza-benzo[e]azulen-4-one | CHEMBL92308
Type:
Small organic molecule
Emp. Form.:
C22H19NO2
Mol. Mass.:
329.3918
SMILES:
O=C1c2cccn2-c2ccccc2OC1(CC1CC1)c1ccccc1
: