Target
Adenylate cyclase type 1
Ligand
BDBM50052122
Substrate
Meas. Tech.
ChEMBL_31876 (CHEMBL645666)
EC50
>2000±n/a nM
Citation
 Robbins, JDBoring, DLTang, WJShank, RSeamon, KB Forskolin carbamates: binding and activation studies with type I adenylyl cyclase. J Med Chem 39:2745-52 (1996)  
Target
Name:
Adenylate cyclase type 1
Synonyms:
ADCY1 Adenylate cyclase | Brain adenylate cyclase 1
Type:
PROTEIN
Mol. Mass.:
123469.95
Organism:
Homo sapiens (Human)
Description:
ChEMBL_31877
Residue:
1119
  
Inhibitor
Name:
BDBM50052122
Synonyms:
Acetic acid (3R,4aR,5S,6S,6aS,10S,10aR,10bS)-10,10b-dihydroxy-6-isobutylcarbamoyloxy-3,4a,7,7,10a-pentamethyl-1-oxo-3-vinyl-dodecahydro-benzo[f]chromen-5-yl ester | CHEMBL90423
Type:
Small organic molecule
Emp. Form.:
C27H43NO8
Mol. Mass.:
509.6322
SMILES:
CC(C)CNC(=O)O[C@@H]1[C@H](OC(C)=O)[C@@]2(C)O[C@](C)(CC(=O)[C@]2(O)[C@@]2(C)[C@@H](O)CCC(C)(C)[C@H]12)C=C
: