Target
Adenylate cyclase type 1
Ligand
BDBM50052115
Substrate
Meas. Tech.
ChEMBL_31879 (CHEMBL645669)
IC50
>150±n/a nM
Citation
 Robbins, JDBoring, DLTang, WJShank, RSeamon, KB Forskolin carbamates: binding and activation studies with type I adenylyl cyclase. J Med Chem 39:2745-52 (1996)  
Target
Name:
Adenylate cyclase type 1
Synonyms:
ADCY1 Adenylate cyclase | Brain adenylate cyclase 1
Type:
PROTEIN
Mol. Mass.:
123469.95
Organism:
Homo sapiens (Human)
Description:
ChEMBL_31877
Residue:
1119
  
Inhibitor
Name:
BDBM50052115
Synonyms:
(2-Dimethylamino-ethyl)-carbamic acid (3R,4aR,5S,6S,6aS,10S,10aR,10bS)-6,10,10b-trihydroxy-3,4a,7,7,10a-pentamethyl-1-oxo-3-vinyl-dodecahydro-benzo[f]chromen-5-yl ester | CHEMBL93042
Type:
Small organic molecule
Emp. Form.:
C25H42N2O7
Mol. Mass.:
482.6102
SMILES:
CN(C)CCNC(=O)O[C@H]1[C@@H](O)[C@H]2C(C)(C)CC[C@H](O)[C@]2(C)[C@@]2(O)C(=O)C[C@@](C)(O[C@]12C)C=C
: