Target
Adenylate cyclase type 1
Ligand
BDBM50052149
Substrate
Meas. Tech.
ChEMBL_31876 (CHEMBL645666)
EC50
>2000±n/a nM
Citation
 Robbins, JDBoring, DLTang, WJShank, RSeamon, KB Forskolin carbamates: binding and activation studies with type I adenylyl cyclase. J Med Chem 39:2745-52 (1996)  
Target
Name:
Adenylate cyclase type 1
Synonyms:
ADCY1 Adenylate cyclase | Brain adenylate cyclase 1
Type:
PROTEIN
Mol. Mass.:
123469.95
Organism:
Homo sapiens (Human)
Description:
ChEMBL_31877
Residue:
1119
  
Inhibitor
Name:
BDBM50052149
Synonyms:
Acetic acid (3R,4aR,5S,6S,6aS,10S,10aR,10bS)-6-allylcarbamoyloxy-10,10b-dihydroxy-3,4a,7,7,10a-pentamethyl-1-oxo-3-vinyl-dodecahydro-benzo[f]chromen-5-yl ester | CHEMBL328358
Type:
Small organic molecule
Emp. Form.:
C26H39NO8
Mol. Mass.:
493.5898
SMILES:
CC(=O)O[C@H]1[C@@H](OC(=O)NCC=C)[C@H]2C(C)(C)CC[C@H](O)[C@]2(C)[C@@]2(O)C(=O)C[C@@](C)(O[C@]12C)C=C
: