Target
Adenylate cyclase type 1
Ligand
BDBM50052130
Substrate
Meas. Tech.
ChEMBL_31878 (CHEMBL645668)
IC50
143±n/a nM
Citation
 Robbins, JDBoring, DLTang, WJShank, RSeamon, KB Forskolin carbamates: binding and activation studies with type I adenylyl cyclase. J Med Chem 39:2745-52 (1996)  
Target
Name:
Adenylate cyclase type 1
Synonyms:
ADCY1 Adenylate cyclase | Brain adenylate cyclase 1
Type:
PROTEIN
Mol. Mass.:
123469.95
Organism:
Homo sapiens (Human)
Description:
ChEMBL_31877
Residue:
1119
  
Inhibitor
Name:
BDBM50052130
Synonyms:
(2-Pyridin-2-yl-ethyl)-carbamic acid (3R,4aR,5S,6S,6aS,10S,10aR,10bS)-6,10,10b-trihydroxy-3,4a,7,7,10a-pentamethyl-1-oxo-3-vinyl-dodecahydro-benzo[f]chromen-5-yl ester | CHEMBL92857
Type:
Small organic molecule
Emp. Form.:
C28H40N2O7
Mol. Mass.:
516.6264
SMILES:
CC1(C)CC[C@H](O)[C@@]2(C)[C@H]1[C@H](O)[C@H](OC(=O)NCCc1ccccn1)[C@@]1(C)O[C@](C)(CC(=O)[C@]21O)C=C
: