Target
Substance-P receptor
Ligand
BDBM50052280
Substrate
Meas. Tech.
ChEMBL_205723 (CHEMBL807969)
IC50
0.22±n/a nM
Citation
 Ladduwahetty, TBaker, RCascieri, MAChambers, MSHaworth, KKeown, LEMacIntyre, DEMetzger, JMOwen, SRycroft, WSadowski, SSeward, EMShepheard, SLSwain, CJTattersall, FDWatt, APWilliamson, DWHargreaves, RJ N-heteroaryl-2-phenyl-3-(benzyloxy)piperidines: a novel class of potent orally active human NK1 antagonists. J Med Chem 39:2907-14 (1996)  
Target
Name:
Substance-P receptor
Synonyms:
NK-1 receptor NK1 Receptor NK1R_HUMAN Neurokinin-1 (NK-1) SPR TACR1 Tachykinin receptor 1 (NK1) | tachykinin
Type:
G Protein-Coupled Receptor (GPCR)
Mol. Mass.:
46254.43
Organism:
Homo sapiens (Human)
Description:
P25103
Residue:
407
  
Inhibitor
Name:
BDBM50052280
Synonyms:
(2S,3S)-3-(3,5-Bis-trifluoromethyl-benzyloxy)-2-phenyl-1-(4H-[1,2,4]triazol-3-ylmethyl)-piperidine CHEMBL99792
Type:
Small organic molecule
Emp. Form.:
C23H22F6N4O
Mol. Mass.:
484.4374
SMILES:
FC(F)(F)c1cc(CO[C@H]2CCCN(Cc3nnc[nH]3)[C@H]2c2ccccc2)cc(c1)C(F)(F)F
: