Target
Substance-K receptor
Ligand
BDBM50052521
Substrate
Meas. Tech.
ChEMBL_209225 (CHEMBL814853)
EC50
>100000±n/a nM
Citation
 Byk, GHalle, DZeltser, IBitan, GSelinger, ZGilon, C Synthesis and biological activity of NK-1 selective, N-backbone cyclic analogs of the C-terminal hexapeptide of substance P. J Med Chem 39:3174-8 (1996)  
Target
Name:
Substance-K receptor
Synonyms:
NK-2 receptor NK2R_RAT Neurokinin A receptor SKR Tac2r Tacr2
Type:
Enzyme Catalytic Domain
Mol. Mass.:
43868.63
Organism:
Rattus norvegicus (Rat)
Description:
Neurokinin NK2 TACR2 Murine::P16610
Residue:
390
  
Inhibitor
Name:
BDBM50052521
Synonyms:
(S)-2-{2-[{(S)-2-[(S)-2-((S)-2-Acetylamino-5-guanidino-pentanoylamino)-3-phenyl-propionylamino]-3-phenyl-propionyl}-(3-amino-propyl)-amino]-acetylamino}-4-methyl-pentanoic acid ((S)-1-carbamoyl-3-methylsulfanyl-propyl)-amide | CHEMBL106184
Type:
Small organic molecule
Emp. Form.:
C42H65N11O7S
Mol. Mass.:
868.1
SMILES:
CSCC[C@H](NC(=O)[C@H](CC(C)C)NC(=O)CN(CCCN)C(=O)[C@H](Cc1ccccc1)NC(=O)[C@H](Cc1ccccc1)NC(=O)[C@H](CCCNC(N)=N)NC(C)=O)C(N)=O
: