Target
5-hydroxytryptamine receptor 1A
Ligand
BDBM50052535
Substrate
Meas. Tech.
ChEMBL_1049 (CHEMBL616250)
Ki
1547±n/a nM
Citation
 Glase, SAAkunne, HCHeffner, TGJaen, JCMacKenzie, RGMeltzer, LTPugsley, TASmith, SJWise, LD Aryl 1-but-3-ynyl-4-phenyl-1,2,3,6-tetrahydropyridines as potential antipsychotic agents: synthesis and structure-activity relationships. J Med Chem 39:3179-87 (1996)  
Target
Name:
5-hydroxytryptamine receptor 1A
Synonyms:
5-HT-1A 5-HT1A 5-hydroxytryptamine receptor 1A (5HT1A) 5ht1a Htr1a Serotonin 1a (5-HT1a) receptor/Adrenergic receptor alpha-1 | Serotonin receptor 1A
Type:
G Protein-Coupled Receptor (GPCR)
Mol. Mass.:
46445.29
Organism:
Rattus norvegicus (rat)
Description:
Binding assays were performed using rat hippocampal membranes.
Residue:
422
  
Inhibitor
Name:
BDBM50052535
Synonyms:
3-[4-(4-Phenyl-3,6-dihydro-2H-pyridin-1-yl)-but-1-ynyl]-phenylamine | CHEMBL108532
Type:
Small organic molecule
Emp. Form.:
C21H22N2
Mol. Mass.:
302.4128
SMILES:
Nc1cccc(c1)C#CCCN1CCC(=CC1)c1ccccc1
: