Target
Glutamate receptor ionotropic, NMDA 1
Ligand
BDBM50008757
Substrate
Meas. Tech.
ChEMBL_140403 (CHEMBL746729)
IC50
280±n/a nM
Citation
 Cai, SXZhou, ZLHuang, JCWhittemore, EREgbuwoku, ZOLü, YHawkinson, JEWoodward, RMWeber, EKeana, JF Synthesis and structure-activity relationships of 1,2,3,4-tetrahydroquinoline-2,3,4-trione 3-oximes: novel and highly potent antagonists for NMDA receptor glycine site. J Med Chem 39:3248-55 (1996)  
Target
Name:
Glutamate receptor ionotropic, NMDA 1
Synonyms:
Glutamate (NMDA) receptor subunit zeta 1 Glutamate-NMDA-Channel Glutamate-NMDA-Polyamine NMDA Nmdar1 | phencyclidine
Type:
Enzyme Catalytic Domain
Mol. Mass.:
105533.40
Organism:
RAT
Description:
P35439
Residue:
938
  
Inhibitor
Name:
BDBM50008757
Synonyms:
5,7-Dichloro-1,4-dihydro-quinoxaline-2,3-dione | CHEMBL282003
Type:
Small organic molecule
Emp. Form.:
C8H4Cl2N2O2
Mol. Mass.:
231.036
SMILES:
Clc1cc(Cl)c2[nH]c(=O)c(=O)[nH]c2c1
: