Target
Vasopressin V2 receptor
Ligand
BDBM50052891
Substrate
Meas. Tech.
ChEMBL_215007 (CHEMBL818806)
IC50
210±n/a nM
Citation
 Ogawa, HYamashita, HKondo, KYamamura, YMiyamoto, HKan, KKitano, KTanaka, MNakaya, KNakamura, SMori, TTominaga, MYabuuchi, Y Orally active, nonpeptide vasopressin V2 receptor antagonists: a novel series of 1-[4-(benzoylamino)benzoyl]-2,3,4,5-tetrahydro-1H-benzazepines and related compounds. J Med Chem 39:3547-55 (1996)  
Target
Name:
Vasopressin V2 receptor
Synonyms:
AVPR V2 Avpr2 V2R_RAT Vasopressin receptor
Type:
G-protein coupled receptor
Mol. Mass.:
40761.85
Organism:
Rattus norvegicus (Rat)
Description:
Residue:
371
  
Inhibitor
Name:
BDBM50052891
Synonyms:
CHEMBL117566 | N-[4-(3,4-Dihydro-2H-quinoline-1-carbonyl)-phenyl]-2,4-dimethyl-benzamide
Type:
Small organic molecule
Emp. Form.:
C25H24N2O2
Mol. Mass.:
384.4703
SMILES:
Cc1ccc(C(=O)Nc2ccc(cc2)C(=O)N2CCCc3ccccc23)c(C)c1
: