Target
ATP-citrate synthase
Ligand
BDBM50052989
Substrate
Meas. Tech.
ChEMBL_29518 (CHEMBL640282)
Ki
2900±n/a nM
Citation
 Gribble, ADDolle, REShaw, AMcNair, DNovelli, RNovelli, CESlingsby, BPShah, VPTew, DSaxty, BAAllen, MGroot, PHPearce, NYates, J ATP-citrate lyase as a target for hypolipidemic intervention. Design and synthesis of 2-substituted butanedioic acids as novel, potent inhibitors of the enzyme. J Med Chem 39:3569-84 (1996)  
Target
Name:
ATP-citrate synthase
Synonyms:
ACLY_RAT | Acly
Type:
PROTEIN
Mol. Mass.:
120645.65
Organism:
Rattus norvegicus
Description:
ChEMBL_857791
Residue:
1100
  
Inhibitor
Name:
BDBM50052989
Synonyms:
2-[8-(2,4-Dichloro-phenyl)-octyl]-2-hydroxy-succinic acid | CHEMBL116883
Type:
Small organic molecule
Emp. Form.:
C18H24Cl2O5
Mol. Mass.:
391.286
SMILES:
OC(=O)CC(O)(CCCCCCCCc1ccc(Cl)cc1Cl)C(O)=O
: