Target
High affinity nerve growth factor receptor
Ligand
BDBM50392788
Substrate
Meas. Tech.
ChEMBL_1809096 (CHEMBL4308455)
Ki
3.7±n/a nM
Citation
 Subramanian, GZhu, YBowen, SJRoush, NWhite, JAHuczek, DZachary, TJavens, CWilliams, TJanssen, AGonzales, A Lead identification and characterization of hTrkA type 2 inhibitors. Bioorg Med Chem Lett 29:0 (2019)  
Target
Name:
High affinity nerve growth factor receptor
Synonyms:
2.7.10.1 NTRK1 NTRK1_HUMAN Neurotrophic tyrosine kinase receptor type 1 Synonyms=MTC TRK1-transforming tyrosine kinase protein TRKA GN Tropomyosin alpha-3 chain/High affinity nerve growth factor receptor Tropomyosin-related kinase A (TrkA) Tyrosine kinase receptor (Trk) Tyrosine kinase receptor A (Trk A) Tyrosine kinase receptor A (TrkA) p140-TrkA
Type:
Mol. Mass.:
87498.18
Organism:
Homo sapiens (Human)
Description:
P04629
Residue:
796
  
Inhibitor
Name:
BDBM50392788
Synonyms:
CHEMBL457614
Type:
Small organic molecule
Emp. Form.:
C17H19ClFN7O
Mol. Mass.:
391.83
SMILES:
CC(C)Oc1cc(Nc2nc(N[C@@H](C)c3ccc(F)cn3)ncc2Cl)[nH]n1
: