Target
Retinoic acid receptor RXR-alpha
Ligand
BDBM31883
Substrate
Meas. Tech.
ChEMBL_196783 (CHEMBL799727)
IC50
>2000±n/a nM
Citation
 Muccio, DDBrouillette, WJAlam, MVaezi, MFSani, BPVenepally, PReddy, LLi, ENorris, AWSimpson-Herren, LHill, DL Conformationally defined 6-s-trans-retinoic acid analogs. 3. Structure-activity relationships for nuclear receptor binding, transcriptional activity, and cancer chemopreventive activity. J Med Chem 39:3625-35 (1996)  
Target
Name:
Retinoic acid receptor RXR-alpha
Synonyms:
Nr2b1 Retinoid X receptor alpha | Rxra
Type:
PROTEIN
Mol. Mass.:
51225.80
Organism:
Mus musculus
Description:
ChEMBL_196493
Residue:
467
  
Inhibitor
Name:
BDBM31883
Synonyms:
9-cis-retinoic acid (9cRA) AT-RA CHEMBL38 SMR000058245 Vitamin A acid [3H]Retinoic acid [3H]tretinoin cid_444795
Type:
radiolabeled ligand
Emp. Form.:
C20H28O2
Mol. Mass.:
300.4351
SMILES:
C\C(\C=C\C1=C(C)CCCC1(C)C)=C/C=C/C(/C)=C/C(O)=O
: