Target
Estrogen receptor
Ligand
BDBM50125052
Substrate
Meas. Tech.
ChEMBL_1809438 (CHEMBL4308797)
IC50
0.316228±n/a nM
Citation
 Scott, JSBreed, JCarbajo, RJDavey, PRGreenwood, RHuynh, HKKlinowska, TMorrow, CJMoss, TAPolanski, RNissink, JWMVarnes, JYang, B Building Bridges in a Series of Estrogen Receptor Degraders: An Application of Metathesis in Medicinal Chemistry. ACS Med Chem Lett 10:1492-1497 (2019)  
Target
Name:
Estrogen receptor
Synonyms:
ER ESR ESR1_HUMAN Estrogen receptor Estrogen receptor (ER-alpha) Estrogen receptor alpha (ER) Nuclear receptor subfamily 3 group A member 1
Type:
Protein
Mol. Mass.:
66230.44
Organism:
Homo sapiens (Human)
Description:
P03372
Residue:
595
  
Inhibitor
Name:
BDBM50125052
Synonyms:
CHEMBL3623004 WO-2014/191726, Example 1
Type:
Small organic molecule
Emp. Form.:
C25H25F3N2O2
Mol. Mass.:
442.4734
SMILES:
C[C@@H]1Cc2c([nH]c3ccccc23)[C@H](N1CC(C)(C)F)c1c(F)cc(\C=C\C(O)=O)cc1F
: