Target
5-hydroxytryptamine receptor 2A
Ligand
BDBM50053189
Substrate
Meas. Tech.
ChEMBL_2578 (CHEMBL617600)
IC50
100±n/a nM
Citation
 Andersen, KLiljefors, THyttel, JPerregaard, J Serotonin 5-HT2 receptor, dopamine D2 receptor, and alpha 1 adrenoceptor antagonists. Conformationally flexible analogues of the atypical antipsychotic sertindole. J Med Chem 39:3723-38 (1996)  
Target
Name:
5-hydroxytryptamine receptor 2A
Synonyms:
5-HT-2A 5-HT2A 5-hydroxytryptamine receptor 2A (5HT2A) Htr2 Serotonin Receptor 2A
Type:
G Protein-Coupled Receptor (GPCR)
Mol. Mass.:
52852.05
Organism:
Rattus norvegicus (rat)
Description:
Rat cortex membranes 5-HT2A receptors.
Residue:
471
  
Inhibitor
Name:
BDBM50053189
Synonyms:
CHEMBL122384 | {4-[5-Chloro-1-(4-fluoro-phenyl)-1H-indol-3-yl]-butyl}-dimethyl-amine
Type:
Small organic molecule
Emp. Form.:
C20H22ClFN2
Mol. Mass.:
344.853
SMILES:
CN(C)CCCCc1cn(-c2ccc(F)cc2)c2ccc(Cl)cc12
: