Target
Glutamate receptor ionotropic, NMDA 2B
Ligand
BDBM50503144
Substrate
Meas. Tech.
ChEMBL_1809550 (CHEMBL4309010)
EC50
33000±n/a nM
Citation
 Burnell, ESIrvine, MFang, GSapkota, KJane, DEMonaghan, DT Positive and Negative Allosteric Modulators of N-Methyl-d-aspartate (NMDA) Receptors: Structure-Activity Relationships and Mechanisms of Action. J Med Chem 62:3-23 (2019)  
Target
Name:
Glutamate receptor ionotropic, NMDA 2B
Synonyms:
GRIN2B Glutamate [NMDA] receptor subunit epsilon 2 N-methyl D-aspartate receptor subtype 2B NMDAR2B NR3 | hNR3
Type:
PROTEIN
Mol. Mass.:
166375.46
Organism:
Homo sapiens (Human)
Description:
ChEMBL_1438829
Residue:
1484
  
Inhibitor
Name:
BDBM50503144
Synonyms:
CHEBI:35420 | CHEMBL1179605
Type:
Small organic molecule
Emp. Form.:
C21H32O5S
Mol. Mass.:
396.541
SMILES:
[H][C@@]12CC[C@H](C(C)=O)[C@@]1(C)CC[C@@]1([H])[C@@]2([H])CC=C2C[C@H](CC[C@]12C)OS(O)(=O)=O
: