Target
1,3-beta-glucan synthase
Ligand
BDBM50503144
Substrate
Meas. Tech.
ChEMBL_1809549 (CHEMBL4309009)
EC50
21000±n/a nM
Citation
 Burnell, ESIrvine, MFang, GSapkota, KJane, DEMonaghan, DT Positive and Negative Allosteric Modulators of N-Methyl-d-aspartate (NMDA) Receptors: Structure-Activity Relationships and Mechanisms of Action. J Med Chem 62:3-23 (2019)  
Target
Name:
1,3-beta-glucan synthase
Synonyms:
1,3-beta-glucan synthase component GSC2 FKS2
Type:
PROTEIN
Mol. Mass.:
217615.31
Organism:
Candida glabrata
Description:
ChEMBL_18077
Residue:
1897
  
Inhibitor
Name:
BDBM50503144
Synonyms:
CHEBI:35420 | CHEMBL1179605
Type:
Small organic molecule
Emp. Form.:
C21H32O5S
Mol. Mass.:
396.541
SMILES:
[H][C@@]12CC[C@H](C(C)=O)[C@@]1(C)CC[C@@]1([H])[C@@]2([H])CC=C2C[C@H](CC[C@]12C)OS(O)(=O)=O
: