Target
Sterol O-acyltransferase 1
Ligand
BDBM50053394
Substrate
Meas. Tech.
ChEMBL_28791 (CHEMBL641701)
IC50
17±n/a nM
Citation
 White, ADPurchase, CFPicard, JAAnderson, MKMueller, SBBocan, TMBousley, RFHamelehle, KLKrause, BRLee, PStanfield, RLReindel, JF Heterocyclic amides: inhibitors of acyl-CoA:cholesterol O-acyl transferase with hypocholesterolemic activity in several species and antiatherosclerotic activity in the rabbit. J Med Chem 39:3908-19 (1996)  
Target
Name:
Sterol O-acyltransferase 1
Synonyms:
ACAT-1 Acat SOAT1_RAT Sterol O-acyltransferase, Soat
Type:
PROTEIN
Mol. Mass.:
64165.56
Organism:
Rattus norvegicus
Description:
ChEMBL_28796
Residue:
545
  
Inhibitor
Name:
BDBM50053394
Synonyms:
2-(5-Dodecyl-[1,3,4]oxadiazol-2-yl)-2-phenyl-N-(2,4,6-trimethoxy-phenyl)-acetamide | CHEMBL126024
Type:
Small organic molecule
Emp. Form.:
C31H43N3O5
Mol. Mass.:
537.6902
SMILES:
CCCCCCCCCCCCc1nnc(o1)C(C(=O)Nc1c(OC)cc(OC)cc1OC)c1ccccc1
: