Target
Calpain-2 catalytic subunit
Ligand
BDBM50053846
Substrate
Meas. Tech.
ChEMBL_43853 (CHEMBL658514)
Ki
74.0±n/a nM
Citation
 Li, ZOrtega-Vilain, ACPatil, GSChu, DLForeman, JEEveleth, DDPowers, JC Novel peptidyl alpha-keto amide inhibitors of calpains and other cysteine proteases. J Med Chem 39:4089-98 (1996)  
Target
Name:
Calpain-2 catalytic subunit
Synonyms:
CAN2_HUMAN CANPL2 Calcium-activated neutral proteinase 2 Calpain M-type Calpain-2 (m-Calpain) Calpain-2 large subunit M-calpain calpain
Type:
Protein
Mol. Mass.:
79965.18
Organism:
Homo sapiens (Human)
Description:
Residue:
700
  
Inhibitor
Name:
BDBM50053846
Synonyms:
2-Diphenylacetylamino-4-methyl-pentanoic acid [1-benzyl-2-(3-morpholin-4-yl-propylcarbamoyl)-2-oxo-ethyl]-amide | CHEMBL132587
Type:
Small organic molecule
Emp. Form.:
C37H46N4O5
Mol. Mass.:
626.7849
SMILES:
CC(C)CC(NC(=O)C(c1ccccc1)c1ccccc1)C(=O)NC(Cc1ccccc1)C(=O)C(=O)NCCCN1CCOCC1
: