Target
Cathepsin B
Ligand
BDBM50053822
Substrate
Meas. Tech.
ChEMBL_47427 (CHEMBL662614)
Ki
750±n/a nM
Citation
 Li, ZOrtega-Vilain, ACPatil, GSChu, DLForeman, JEEveleth, DDPowers, JC Novel peptidyl alpha-keto amide inhibitors of calpains and other cysteine proteases. J Med Chem 39:4089-98 (1996)  
Target
Name:
Cathepsin B
Synonyms:
APP secretase CATB_HUMAN CTSB Cathepsin B light chain | Cathepsin B1
Type:
Enzyme
Mol. Mass.:
37819.69
Organism:
Homo sapiens (Human)
Description:
gi_63102437
Residue:
339
  
Inhibitor
Name:
BDBM50053822
Synonyms:
CHEMBL132586 {3-Methyl-1-[1-(pyridin-2-ylmethyl)-aminooxalyl]-butylcarbamoyl}-butyl)-carbamic acid benzyl ester
Type:
Small organic molecule
Emp. Form.:
C26H34N4O5
Mol. Mass.:
482.572
SMILES:
CCCC(NC(=O)C(CC(C)C)NC(=O)OCc1ccccc1)C(=O)C(=O)NCc1ccccn1
: