Target
Calpain-1 catalytic subunit
Ligand
BDBM50042386
Substrate
Meas. Tech.
ChEMBL_43668 (CHEMBL656201)
Ki
250±n/a nM
Citation
 Li, ZOrtega-Vilain, ACPatil, GSChu, DLForeman, JEEveleth, DDPowers, JC Novel peptidyl alpha-keto amide inhibitors of calpains and other cysteine proteases. J Med Chem 39:4089-98 (1996)  
Target
Name:
Calpain-1 catalytic subunit
Synonyms:
CAN1_HUMAN CAPN1 Calpain-1 (u-Calpain) Calpain1
Type:
Protein
Mol. Mass.:
81880.51
Organism:
Homo sapiens (Human)
Description:
Residue:
714
  
Inhibitor
Name:
BDBM50042386
Synonyms:
CHEMBL325147 | [1-(1-Ethylaminooxalyl-propylcarbamoyl)-3-methyl-butyl]-carbamic acid benzyl ester
Type:
Small organic molecule
Emp. Form.:
C21H31N3O5
Mol. Mass.:
405.4879
SMILES:
CCNC(=O)C(=O)C(CC)NC(=O)C(CC(C)C)NC(=O)OCc1ccccc1
: