Target
Calpain-1 catalytic subunit
Ligand
BDBM50053832
Substrate
Meas. Tech.
ChEMBL_43668 (CHEMBL656201)
Ki
250±n/a nM
Citation
 Li, ZOrtega-Vilain, ACPatil, GSChu, DLForeman, JEEveleth, DDPowers, JC Novel peptidyl alpha-keto amide inhibitors of calpains and other cysteine proteases. J Med Chem 39:4089-98 (1996)  
Target
Name:
Calpain-1 catalytic subunit
Synonyms:
CAN1_HUMAN CAPN1 Calpain-1 (u-Calpain) Calpain1
Type:
Protein
Mol. Mass.:
81880.51
Organism:
Homo sapiens (Human)
Description:
Residue:
714
  
Inhibitor
Name:
BDBM50053832
Synonyms:
CHEMBL422260 | {1-[1-(Isoquinolin-1-ylmethyl)-aminooxalyl]-propylcarbamoyl}-3-methyl-butyl)-carbamic acid benzyl ester
Type:
Small organic molecule
Emp. Form.:
C29H34N4O5
Mol. Mass.:
518.6041
SMILES:
CCC(NC(=O)C(CC(C)C)NC(=O)OCc1ccccc1)C(=O)C(=O)NCc1nccc2ccccc12
: