Target
Calpain-1 catalytic subunit
Ligand
BDBM50053849
Substrate
Meas. Tech.
ChEMBL_43668 (CHEMBL656201)
Ki
140±n/a nM
Citation
 Li, ZOrtega-Vilain, ACPatil, GSChu, DLForeman, JEEveleth, DDPowers, JC Novel peptidyl alpha-keto amide inhibitors of calpains and other cysteine proteases. J Med Chem 39:4089-98 (1996)  
Target
Name:
Calpain-1 catalytic subunit
Synonyms:
CAN1_HUMAN CAPN1 Calpain-1 (u-Calpain) Calpain1
Type:
Protein
Mol. Mass.:
81880.51
Organism:
Homo sapiens (Human)
Description:
Residue:
714
  
Inhibitor
Name:
BDBM50053849
Synonyms:
CHEMBL134002 | {3-Methyl-1-[1-(3-morpholin-4-yl-propylaminooxalyl)-propylcarbamoyl]-butyl}-carbamic acid benzyl ester
Type:
Small organic molecule
Emp. Form.:
C26H40N4O6
Mol. Mass.:
504.619
SMILES:
CCC(NC(=O)C(CC(C)C)NC(=O)OCc1ccccc1)C(=O)C(=O)NCCCN1CCOCC1
: