Target
Cathepsin B
Ligand
BDBM50053863
Substrate
Meas. Tech.
ChEMBL_47427 (CHEMBL662614)
Ki
1200±n/a nM
Citation
 Li, ZOrtega-Vilain, ACPatil, GSChu, DLForeman, JEEveleth, DDPowers, JC Novel peptidyl alpha-keto amide inhibitors of calpains and other cysteine proteases. J Med Chem 39:4089-98 (1996)  
Target
Name:
Cathepsin B
Synonyms:
APP secretase CATB_HUMAN CTSB Cathepsin B light chain | Cathepsin B1
Type:
Enzyme
Mol. Mass.:
37819.69
Organism:
Homo sapiens (Human)
Description:
gi_63102437
Residue:
339
  
Inhibitor
Name:
BDBM50053863
Synonyms:
(3-Methyl-1-{1-[2-(1-methyl-1H-pyrrol-2-yl)-ethylaminooxalyl]-propylcarbamoyl}-butyl)-carbamic acid benzyl ester | CHEMBL132773
Type:
Small organic molecule
Emp. Form.:
C26H36N4O5
Mol. Mass.:
484.5878
SMILES:
CCC(NC(=O)C(CC(C)C)NC(=O)OCc1ccccc1)C(=O)C(=O)NCCc1cccn1C
: