Target
Inosine-5'-monophosphate dehydrogenase 2
Ligand
BDBM50053990
Substrate
Meas. Tech.
ChEMBL_89810 (CHEMBL697548)
pH
8±n/a
IC50
>100000±n/a nM
Comments
extracted
Citation
 Nelson, PHCarr, SFDevens, BHEugui, EMFranco, FGonzalez, CHawley, RCLoughhead, DGMilan, DJPapp, EPatterson, JWRouhafza, SSjogren, EBSmith, DBStephenson, RATalamas, FXWaltos, AMWeikert, RJWu, JC Structure-activity relationships for inhibition of inosine monophosphate dehydrogenase by nuclear variants of mycophenolic acid. J Med Chem 39:4181-96 (1996)  
Target
Name:
Inosine-5'-monophosphate dehydrogenase 2
Synonyms:
IMDH2_HUMAN IMPD 2 IMPDH-II Inosine 5'-monophosphate dehydrogenase II (IMPDH II) Inosine-5 -monophosphate dehydrogenase 2 | Inosine-5'-monophosphate dehydrogenase (IMPDH)
Type:
Enzyme
Mol. Mass.:
55806.87
Organism:
Homo sapiens (Human)
Description:
Recombinant IMPDH2 expressed in E. coli.
Residue:
514
  
Inhibitor
Name:
BDBM50053990
Synonyms:
(E)-6-(4-Hydroxy-6-methoxy-2,7-dimethyl-3-oxo-2,3-dihydro-1H-isoindol-5-yl)-4-methyl-hex-4-enoic acid | CHEMBL134458
Type:
Small organic molecule
Emp. Form.:
C18H23NO5
Mol. Mass.:
333.3789
SMILES:
COc1c(C)c2CN(C)C(=O)c2c(O)c1C\C=C(/C)CCC(O)=O
: