Target
Inosine-5'-monophosphate dehydrogenase 2
Ligand
BDBM19264
Substrate
Meas. Tech.
ChEMBL_89807 (CHEMBL698525)
pH
8±n/a
IC50
24.8±n/a nM
Comments
extracted
Citation
 Nelson, PHCarr, SFDevens, BHEugui, EMFranco, FGonzalez, CHawley, RCLoughhead, DGMilan, DJPapp, EPatterson, JWRouhafza, SSjogren, EBSmith, DBStephenson, RATalamas, FXWaltos, AMWeikert, RJWu, JC Structure-activity relationships for inhibition of inosine monophosphate dehydrogenase by nuclear variants of mycophenolic acid. J Med Chem 39:4181-96 (1996)  
Target
Name:
Inosine-5'-monophosphate dehydrogenase 2
Synonyms:
IMDH2_HUMAN IMPD 2 IMPDH-II Inosine 5'-monophosphate dehydrogenase II (IMPDH II) Inosine-5 -monophosphate dehydrogenase 2 | Inosine-5'-monophosphate dehydrogenase (IMPDH)
Type:
Enzyme
Mol. Mass.:
55806.87
Organism:
Homo sapiens (Human)
Description:
Recombinant IMPDH2 expressed in E. coli.
Residue:
514
  
Inhibitor
Name:
BDBM19264
Synonyms:
(4E)-6-(4-hydroxy-6-methoxy-7-methyl-3-oxo-1,3-dihydro-2-benzofuran-5-yl)-4-methylhex-4-enoic acid CHEMBL866 Mycophenolic Acid (MPA) | Myfortic
Type:
Small organic molecule
Emp. Form.:
C17H20O6
Mol. Mass.:
320.3371
SMILES:
COc1c(C)c2COC(=O)c2c(O)c1C\C=C(/C)CCC(O)=O
: