Target
Inosine-5'-monophosphate dehydrogenase 2
Ligand
BDBM50054032
Substrate
Meas. Tech.
ChEMBL_89808 (CHEMBL698526)
IC50
121±n/a nM
Citation
 Nelson, PHCarr, SFDevens, BHEugui, EMFranco, FGonzalez, CHawley, RCLoughhead, DGMilan, DJPapp, EPatterson, JWRouhafza, SSjogren, EBSmith, DBStephenson, RATalamas, FXWaltos, AMWeikert, RJWu, JC Structure-activity relationships for inhibition of inosine monophosphate dehydrogenase by nuclear variants of mycophenolic acid. J Med Chem 39:4181-96 (1996)  
Target
Name:
Inosine-5'-monophosphate dehydrogenase 2
Synonyms:
IMDH2_HUMAN IMPD 2 IMPDH-II Inosine 5'-monophosphate dehydrogenase II (IMPDH II) Inosine-5 -monophosphate dehydrogenase 2 | Inosine-5'-monophosphate dehydrogenase (IMPDH)
Type:
Enzyme
Mol. Mass.:
55806.87
Organism:
Homo sapiens (Human)
Description:
Recombinant IMPDH2 expressed in E. coli.
Residue:
514
  
Inhibitor
Name:
BDBM50054032
Synonyms:
(E)-6-(4-Hydroxy-6-methoxy-7-methyl-3-oxo-1,3-dihydro-benzo[c]thiophen-5-yl)-4-methyl-hex-4-enoic acid | CHEMBL135788
Type:
Small organic molecule
Emp. Form.:
C17H20O5S
Mol. Mass.:
336.403
SMILES:
COc1c(C)c2CSC(=O)c2c(O)c1C\C=C(/C)CCC(O)=O
: