Target
D(1A) dopamine receptor
Ligand
BDBM50054149
Substrate
Meas. Tech.
ChEMBL_60193 (CHEMBL879565)
IC50
38300±n/a nM
Citation
 Comoy, CMarot, CPodona, TBaudin, MLMorin-Allory, LGuillaumet, GPfeiffer, BCaignard, DHRenard, PRettori, MCAdam, GGuardiola-Lemaitre, B 3-amino-3,4-dihydro-2H-1-benzopyran derivatives as 5-HT1A receptor ligands and potential anxiolytic agents. 2. Synthesis and quantitative structure-activity relationship studies of spiro[pyrrolidine- and piperidine-2,3'(2'H)-benzopyrans] J Med Chem 39:4285-98 (1996)  
Target
Name:
D(1A) dopamine receptor
Synonyms:
D(1A) dopamine receptor DOPAMINE D1 DRD1_BOVIN | Dopamine receptor
Type:
Enzyme Catalytic Domain
Mol. Mass.:
49330.65
Organism:
BOVINE
Description:
DOPAMINE D1 DRD1 BOVINE::Q95136
Residue:
446
  
Inhibitor
Name:
BDBM50054149
Synonyms:
1'-[4-(4-fluorophenylcarboxamido)butyl]-5-methoxyspiro[3,4-dihydro-2H-chromene-3,2'-(hexahydropyridine)] | CHEMBL334498
Type:
Small organic molecule
Emp. Form.:
C25H31FN2O3
Mol. Mass.:
426.5236
SMILES:
COc1cccc2OCC3(CCCCN3CCCCNC(=O)c3ccc(F)cc3)Cc12
: