Target
Steroid 17-alpha-hydroxylase/17,20 lyase
Ligand
BDBM50054195
Substrate
Meas. Tech.
ChEMBL_204436 (CHEMBL811229)
IC50
1220±n/a nM
Citation
 Li, JSLi, YSon, CBrodie, AM Synthesis and evaluation of pregnane derivatives as inhibitors of human testicular 17 alpha-hydroxylase/C17,20-lyase. J Med Chem 39:4335-9 (1996)  
Target
Name:
Steroid 17-alpha-hydroxylase/17,20 lyase
Synonyms:
CP17A_HUMAN CYP17A1 Cytochrome P450 17A1 Cytochrome P450 C17 (CYP17) Cytochrome P450-C17 P450-C17 Steroid 17-alpha-Monooxygenase (CYP17) Steroid 17-alpha-monooxygenase | cytochrome P450 monooxygenase 17 alpha hydroxylase/17,20-lyase (CYP17)
Type:
Enzyme
Mol. Mass.:
57382.42
Organism:
Homo sapiens (Human)
Description:
E.coli expressing human CYP17
Residue:
508
  
Inhibitor
Name:
BDBM50054195
Synonyms:
2-((10R,13S)-10,13-Dimethyl-3-oxo-1,2,3,6,7,8,9,10,11,12,13,14,15,16-tetradecahydro-cyclopenta[a]phenanthren-17-ylidene)-propionitrile | CHEMBL336025
Type:
Small organic molecule
Emp. Form.:
C22H29NO
Mol. Mass.:
323.4718
SMILES:
C\C(C#N)=C1\CCC2C3CCC4=CC(=O)CC[C@]4(C)C3CC[C@]12C
: